Target
Prostaglandin G/H synthase 1
Ligand
BDBM34233
Substrate
Meas. Tech.
ChEMBL_511829 (CHEMBL969892)
IC50
2100±n/a nM
Citation
 Scholz, MUlbrich, HKDannhardt, G Investigations concerning the COX/5-LOX inhibiting and hydroxyl radical scavenging potencies of novel 4,5-diaryl isoselenazoles. Eur J Med Chem 43:1152-9 (2008)  
Target
Name:
Prostaglandin G/H synthase 1
Synonyms:
COX-1 Cyclooxygenase PGH1_BOVIN | PTGS1
Type:
PROTEIN
Mol. Mass.:
68814.10
Organism:
Bos taurus
Description:
ChEMBL_547440
Residue:
600
  
Inhibitor
Name:
BDBM34233
Synonyms:
2-Phenyl-benzo[d]isoselenazol-3-one 2-phenyl-1,2-benzisoselazol-3(2H)-one 2-phenylbenzo[d][1,2]selenazol-3(2H)-one EBSELEN MLS000028488 cid_3194 | med.21724, Compound 153
Type:
Small organic molecule
Emp. Form.:
C13H9NOSe
Mol. Mass.:
274.18
SMILES:
O=c1n([se]c2ccccc12)-c1ccccc1
: