Target
cAMP-specific 3',5'-cyclic phosphodiesterase 4D
Ligand
BDBM50240404
Substrate
Meas. Tech.
ChEMBL_511180 (CHEMBL1000429)
IC50
166±n/a nM
Citation
 Kodimuthali, AJabaris, SSPal, M Recent advances on phosphodiesterase 4 inhibitors for the treatment of asthma and chronic obstructive pulmonary disease. J Med Chem 51:5471-89 (2008)  
Target
Name:
cAMP-specific 3',5'-cyclic phosphodiesterase 4D
Synonyms:
3',5'-cyclic phosphodiesterase PDE43 PDE4D_HUMAN | Phosphodiesterase 4D
Type:
Protein
Mol. Mass.:
91092.69
Organism:
Homo sapiens (Human)
Description:
Q08499
Residue:
809
  
Inhibitor
Name:
BDBM50240404
Synonyms:
(Ibudilast)1-(2-Isopropyl-pyrazolo[1,5-a]pyridin-3-yl)-2-methyl-propan-1-one CHEMBL19449 | IBUDILAST
Type:
Small organic molecule
Emp. Form.:
C14H18N2O
Mol. Mass.:
230.3055
SMILES:
CC(C)C(=O)c1c(nn2ccccc12)C(C)C
: