Target
Salicyl-AMP ligase / salicyl-S-ArCP synthetase
Ligand
BDBM50412366
Substrate
Meas. Tech.
ChEMBL_511444 (CHEMBL1003925)
Ki
42500±n/a nM
Citation
 Neres, JLabello, NPSomu, RVBoshoff, HIWilson, DJVannada, JChen, LBarry, CEBennett, EMAldrich, CC Inhibition of siderophore biosynthesis in Mycobacterium tuberculosis with nucleoside bisubstrate analogues: structure-activity relationships of the nucleobase domain of 5'-O-[N-(salicyl)sulfamoyl]adenosine. J Med Chem 51:5349-70 (2008)  
Target
Name:
Salicyl-AMP ligase / salicyl-S-ArCP synthetase
Synonyms:
2,3-dihydroxybenzoate-AMP ligase mbtA
Type:
PROTEIN
Mol. Mass.:
59275.32
Organism:
Mycobacterium tuberculosis
Description:
ChEMBL_423930
Residue:
565
  
Inhibitor
Name:
BDBM50412366
Synonyms:
CHEMBL609102
Type:
Small organic molecule
Emp. Form.:
C17H17N9O8S
Mol. Mass.:
507.437
SMILES:
Nc1ncnc2n(C3OC(COS(=O)(=O)NC(=O)c4ccccc4O)C(O)C3O)c(N=[N+]=[N-])nc12
: