Target
Salicyl-AMP ligase / salicyl-S-ArCP synthetase
Ligand
BDBM50412380
Substrate
Meas. Tech.
ChEMBL_511444 (CHEMBL1003925)
Ki
4.4±n/a nM
Citation
 Neres, JLabello, NPSomu, RVBoshoff, HIWilson, DJVannada, JChen, LBarry, CEBennett, EMAldrich, CC Inhibition of siderophore biosynthesis in Mycobacterium tuberculosis with nucleoside bisubstrate analogues: structure-activity relationships of the nucleobase domain of 5'-O-[N-(salicyl)sulfamoyl]adenosine. J Med Chem 51:5349-70 (2008)  
Target
Name:
Salicyl-AMP ligase / salicyl-S-ArCP synthetase
Synonyms:
2,3-dihydroxybenzoate-AMP ligase mbtA
Type:
PROTEIN
Mol. Mass.:
59275.32
Organism:
Mycobacterium tuberculosis
Description:
ChEMBL_423930
Residue:
565
  
Inhibitor
Name:
BDBM50412380
Synonyms:
CHEMBL516501
Type:
Small organic molecule
Emp. Form.:
C19H21N6O8S
Mol. Mass.:
493.471
SMILES:
CCNc1ncnc2n(cnc12)[C@@H]1O[C@H](COS(=O)(=O)[N-]C(=O)c2ccccc2O)[C@@H](O)[C@H]1O
: