Target
Aromatase
Ligand
BDBM50213251
Substrate
Meas. Tech.
ChEMBL_553587 (CHEMBL958770)
IC50
40950±n/a nM
Citation
 Endringer, DCGuimarães, KGKondratyuk, TPPezzuto, JMBraga, FC Selective inhibition of aromatase by a dihydroisocoumarin from Xyris pterygoblephara. J Nat Prod 71:1082-4 (2008)  
Target
Name:
Aromatase
Synonyms:
ARO1 CP19A_HUMAN CYP19 CYPXIX Cytochrome P450 19A1 Cytochrome P450-C19 (CYP19) FL cytokine receptor precursor | P-450AROM
Type:
Enzyme
Mol. Mass.:
57888.92
Organism:
Homo sapiens (Human)
Description:
P11511
Residue:
503
  
Inhibitor
Name:
BDBM50213251
Synonyms:
(rac)-7-hydroxy-2-(4-hydroxy-3-(3-methylbut-2-enyl)phenyl)chroman-4-one 7-hydroxy-2-[4-hydroxy-3-(3-methylbut-2-enyl)phenyl]chroman-4-one CHEMBL389924
Type:
Small organic molecule
Emp. Form.:
C20H20O4
Mol. Mass.:
324.3704
SMILES:
[#6]\[#6](-[#6])=[#6]\[#6]-c1cc(ccc1-[#8])-[#6]-1-[#6]-[#6](=O)-c2ccc(-[#8])cc2-[#8]-1
: