Target
Gamma-aminobutyric acid receptor subunit alpha-1
Ligand
BDBM50244228
Substrate
Meas. Tech.
ChEMBL_491431 (CHEMBL948526)
Ki
16.4±n/a nM
Citation
 Harris, DClayton, TCook, JSahbaie, PHalliwell, RFFurtmüller, RHuck, SSieghart, WDeLorey, TM Selective influence on contextual memory: physiochemical properties associated with selectivity of benzodiazepine ligands at GABAA receptors containing the alpha5 subunit. J Med Chem 51:3788-803 (2008)  
Target
Name:
Gamma-aminobutyric acid receptor subunit alpha-1
Synonyms:
Benzodiazepine central GABA A Benzodiazepine liver GABA(A) receptor subunit alpha-1 GABA-A receptor GBRA1_HUMAN TBPS | agonist GABA site
Type:
Protein
Mol. Mass.:
51817.35
Organism:
Homo sapiens (Human)
Description:
P14867
Residue:
456
  
Inhibitor
Name:
BDBM50244228
Synonyms:
CHEMBL458319 | cyclopropylmethyl 7-chloro-4-methyl-5-oxo-4,5-dihydroimidazo[1,5-a]quinazoline-3-carboxylate
Type:
Small organic molecule
Emp. Form.:
C16H14ClN3O3
Mol. Mass.:
331.754
SMILES:
Cn1c2c(ncn2c2ccc(Cl)cc2c1=O)C(=O)OCC1CC1
: