Target
Lysosomal alpha-glucosidase
Ligand
BDBM50316179
Substrate
Meas. Tech.
ChEMBL_491529 (CHEMBL937799)
Ki
540±n/a nM
Citation
 Ozaki, SOe, HKitamura, S Alpha-glucosidase inhibitor from Kothala-himbutu (Salacia reticulata WIGHT). J Nat Prod 71:981-4 (2008)  
Target
Name:
Lysosomal alpha-glucosidase
Synonyms:
Acidic alpha-glucosidase LYAG_RAT
Type:
PROTEIN
Mol. Mass.:
106191.24
Organism:
Rattus norvegicus
Description:
ChEMBL_1506157
Residue:
953
  
Inhibitor
Name:
BDBM50316179
Synonyms:
(1S,2R,3R,4S)-1-{(1S)-2-[(2R,3S,4S)-3,4-dihydroxy-2-(hydroxymethyl)tetrahydrothiophenium-1-yl]-1-hydroxyethyl}-2,3,4,5-tetrahydroxypentyl sulfate CHEMBL1093264
Type:
Small organic molecule
Emp. Form.:
C12H24O12S2
Mol. Mass.:
424.442
SMILES:
OC[C@H](O)[C@@H](O)[C@@H](O)[C@H](OS([O-])(=O)=O)[C@H](O)C[S+]1C[C@@H](O)[C@H](O)[C@H]1CO
: