Target
11-beta-hydroxysteroid dehydrogenase 1
Ligand
BDBM50243634
Substrate
Meas. Tech.
ChEMBL_487342 (CHEMBL1021868)
IC50
6.1±n/a nM
Citation
 Julian, LDWang, ZBostick, TCaille, SChoi, RDeGraffenreid, MDi, YHe, XHungate, RWJaen, JCLiu, JMonshouwer, MMcMinn, DRew, YSudom, ASun, DTu, HUrsu, SWalker, NYan, XYe, QPowers, JP Discovery of novel, potent benzamide inhibitors of 11beta-hydroxysteroid dehydrogenase type 1 (11beta-HSD1) exhibiting oral activity in an enzyme inhibition ex vivo model. J Med Chem 51:3953-60 (2008)  
Target
Name:
11-beta-hydroxysteroid dehydrogenase 1
Synonyms:
11-DH 11-beta-Hydroxysteroid Dehydrogenase 1 (11-beta-HSD1) 11-beta-hydroxysteroid dehydrogenase 1 (11HSD1) Corticosteroid 11-beta-dehydrogenase isozyme 1 (11-beta-HSD-1) Corticosteroid 11-beta-dehydrogenase isozyme 1 (11beta-HSD1) HSD11 HSD11L | SDR26C1
Type:
Enzyme
Mol. Mass.:
32409.16
Organism:
Homo sapiens (Human)
Description:
P28845
Residue:
292
  
Inhibitor
Name:
BDBM50243634
Synonyms:
(S)-N-(cis-4-Phenyl)cyclohexyl-4-(1,1,1-trifluoro-2-hydroxypropan-2-yl)-N-cyclopropylbenzamide | CHEMBL471750
Type:
Small organic molecule
Emp. Form.:
C25H28F3NO2
Mol. Mass.:
431.4905
SMILES:
C[C@](O)(c1ccc(cc1)C(=O)N(C1CC1)[C@H]1CC[C@H](CC1)c1ccccc1)C(F)(F)F
: