Target
Growth hormone secretagogue receptor type 1
Ligand
BDBM21941
Substrate
Meas. Tech.
ChEMBL_491617 (CHEMBL945388)
EC50
1.92±n/a nM
Citation
 Li, JChen, SYMurphy, BJFlynn, NSeethala, RSlusarchyk, DYan, MSleph, PZhang, HHumphreys, WGEwing, WRRobl, JAGordon, DTino, JA (D)-2-tert-Butoxycarbonylamino-5,5-difluoro-5-phenyl-pentanoic acid: synthesis and incorporation into the growth hormone secretagogues. Bioorg Med Chem Lett 18:4072-4 (2008)  
Target
Name:
Growth hormone secretagogue receptor type 1
Synonyms:
GH-releasing peptide receptor GHS-R GHSR_HUMAN Ghrelin receptor | Ghrelin receptor 1a (GHS-R1a)
Type:
Receptor
Mol. Mass.:
41334.57
Organism:
Homo sapiens (Human)
Description:
Receptor binding studies use plasma membranes from LLC PK-1 cells transiently transfected with hGHSR1a.
Residue:
366
  
Inhibitor
Name:
BDBM21941
Synonyms:
2-{5-[(1S)-1-(2-amino-2-methylpropanamido)-2-(benzyloxy)ethyl]-1H-1,2,3,4-tetrazol-1-yl}ethyl N-(4-hydroxybutyl)carbamate CHEMBL398372 | Tetrazole-based compound, 2
Type:
Small organic molecule
Emp. Form.:
C21H33N7O5
Mol. Mass.:
463.5306
SMILES:
CC(C)(N)C(=O)N[C@H](COCc1ccccc1)c1nnnn1CCOC(=O)NCCCCO
: