Target
Cytochrome P450 2D6
Ligand
BDBM50264211
Substrate
Meas. Tech.
ChEMBL_535290 (CHEMBL982615)
IC50
23500±n/a nM
Citation
 Sato, IMorihira, KInami, HKubota, HMorokata, TSuzuki, KIura, YNitta, AImaoka, TTakahashi, TTakeuchi, MOhta, MTsukamoto, S Design and synthesis of 6-fluoro-2-naphthyl derivatives as novel CCR3 antagonists with reduced CYP2D6 inhibition. Bioorg Med Chem 16:8607-18 (2008)  
Target
Name:
Cytochrome P450 2D6
Synonyms:
CP2D6_HUMAN CYP2DL1 Cytochrome P450 2D6 (CYP2D6) P450-DB1
Type:
Protein
Mol. Mass.:
55774.82
Organism:
Homo sapiens (Human)
Description:
P10635
Residue:
497
  
Inhibitor
Name:
BDBM50264211
Synonyms:
CHEMBL488930 | N-{(3-exo)-8-[(6-Fluoro-2-naphthyl)methyl]-8-azabicyclo[3.2.1]oct-3-yl}-3-(piperidin-1-ylcarbonyl)pyridine-2-carboxamide
Type:
Small organic molecule
Emp. Form.:
C30H33FN4O2
Mol. Mass.:
500.607
SMILES:
Fc1ccc2cc(CN3[C@@H]4CC[C@@H]3CC(C4)NC(=O)c3ncccc3C(=O)N3CCCCC3)ccc2c1
: