Target
C-C chemokine receptor type 3
Ligand
BDBM50264208
Substrate
Meas. Tech.
ChEMBL_535295 (CHEMBL982620)
IC50
44±n/a nM
Citation
 Sato, IMorihira, KInami, HKubota, HMorokata, TSuzuki, KIura, YNitta, AImaoka, TTakahashi, TTakeuchi, MOhta, MTsukamoto, S Design and synthesis of 6-fluoro-2-naphthyl derivatives as novel CCR3 antagonists with reduced CYP2D6 inhibition. Bioorg Med Chem 16:8607-18 (2008)  
Target
Name:
C-C chemokine receptor type 3
Synonyms:
C-C CKR-3 CC-CKR-3 CCR3 CD_antigen=CD193 CMKBR3 | Eosinophil eotaxin receptor
Type:
Enzyme
Mol. Mass.:
41053.88
Organism:
Homo sapiens (Human)
Description:
P51677
Residue:
355
  
Inhibitor
Name:
BDBM50264208
Synonyms:
CHEMBL499971 | N-Cyclohexyl-N'-{(3-exo)-8-[(6-fluoro-2-naphthyl)-methyl]-8-azabicyclo[3.2.1]oct-3-yl}-N-methylphthalamide
Type:
Small organic molecule
Emp. Form.:
C33H38FN3O2
Mol. Mass.:
527.6721
SMILES:
CN(C1CCCCC1)C(=O)c1ccccc1C(=O)NC1C[C@H]2CC[C@H](C1)N2Cc1ccc2cc(F)ccc2c1
: