Target
Kappa-type opioid receptor
Ligand
BDBM50274016
Substrate
Meas. Tech.
ChEMBL_537686 (CHEMBL993480)
IC50
0.647±n/a nM
Citation
 Kawai, KHayakawa, JMiyamoto, TImamura, YYamane, SWakita, HFujii, HKawamura, KMatsuura, HIzumimoto, NKobayashi, REndo, TNagase, H Design, synthesis, and structure-activity relationship of novel opioid kappa-agonists. Bioorg Med Chem 16:9188-201 (2008)  
Target
Name:
Kappa-type opioid receptor
Synonyms:
KOR-1 OPIATE Kappa Oprk1
Type:
Enzyme
Mol. Mass.:
42656.78
Organism:
Mus musculus (Mouse)
Description:
P33534
Residue:
380
  
Inhibitor
Name:
BDBM50274016
Synonyms:
(2E)-N-[(5R,6R)-17-(Cyclopropylmethyl)-4,5-epoxy-3,14-dihydroxymorphinan-6-yl]-N-methylhex-2-enamide | CHEMBL459979
Type:
Small organic molecule
Emp. Form.:
C27H36N2O4
Mol. Mass.:
452.5857
SMILES:
CCC\C=C\C(=O)N(C)[C@@H]1CC[C@@]2(O)[C@H]3Cc4ccc(O)c5O[C@@H]1[C@]2(CCN3CC1CC1)c45
: