Target
Glycophorin-A
Ligand
BDBM50310365
Substrate
Meas. Tech.
ChEMBL_558160 (CHEMBL961629)
Kd
270000±n/a nM
Citation
 Ujihara, SOishi, TTorikai, KKonoki, KMatsumori, NMurata, MOshima, YAimoto, S Interaction of ladder-shaped polyethers with transmembrane alpha-helix of glycophorin A as evidenced by saturation transfer difference NMR and surface plasmon resonance. Bioorg Med Chem Lett 18:6115-8 (2008)  
Target
Name:
Glycophorin-A
Synonyms:
GLPA_HUMAN GYPA
Type:
PROTEIN
Mol. Mass.:
16327.75
Organism:
Homo sapiens (Human)
Description:
ChEMBL_558160
Residue:
150
  
Inhibitor
Name:
BDBM50310365
Synonyms:
CHEMBL1077121 | desulfated yessotoxin
Type:
Small organic molecule
Emp. Form.:
C55H82O14
Mol. Mass.:
967.2312
SMILES:
C[C@H]1CC[C@]2(C)O[C@]3(C)CC[C@@H]4O[C@@H]5C[C@@H]6O[C@@H]7C[C@H](O)[C@@](C)(CCO)O[C@H]7C[C@H]6O[C@H]5C[C@H]4O[C@H]3C[C@H]2O[C@H]2C[C@H]3O[C@H]4C[C@H]5O[C@@H](C(=C)C[C@@H]5O[C@]4(C)C[C@@H]3O[C@H]12)[C@](C)(O)\C=C\C(=C)CC=C
: