Target
Calcitonin gene-related peptide type 1 receptor
Ligand
BDBM50255069
Substrate
Meas. Tech.
ChEMBL_560219 (CHEMBL1015394)
IC50
0.87±n/a nM
Citation
 Stump, CABell, IMBednar, RABruno, JGFay, JFGallicchio, SNJohnston, VKMoore, ELMosser, SDQuigley, AGSalvatore, CATheberge, CRBlair Zartman, CZhang, XFKane, SAGraham, SLVacca, JPWilliams, TM The discovery of highly potent CGRP receptor antagonists. Bioorg Med Chem Lett 19:214-7 (2008)  
Target
Name:
Calcitonin gene-related peptide type 1 receptor
Synonyms:
Adrenomedullin receptor AM1; CALCRL/RAMP2 CALRL_HUMAN CGRP type 1 receptor mRNA Calcitonin gene-related peptide (CGRP) receptor Calcitonin receptor-like receptor Human CL receptor
Type:
Enzyme Catalytic Domain
Mol. Mass.:
52980.45
Organism:
Homo sapiens (Human)
Description:
Q16602
Residue:
461
  
Inhibitor
Name:
BDBM50255069
Synonyms:
(S)-2-(5,7-dimethyl-2-oxo-3-(2-oxo-2-(2'-oxo-1,1',2',3-tetrahydrospiro[indene-2,3'-pyrrolo[2,3-b]pyridine]-5-ylamino)ethyl)-2,3-dihydro-1H-benzo[d]imidazol-1-yl)-N,N-dimethylacetamide | CHEMBL517467
Type:
Small organic molecule
Emp. Form.:
C30H30N6O4
Mol. Mass.:
538.597
SMILES:
CN(C)C(=O)Cn1c2c(C)cc(C)cc2n(CC(=O)Nc2ccc3C[C@@]4(Cc3c2)C(=O)Nc2ncccc42)c1=O
: