Target
Bifunctional dihydrofolate reductase-thymidylate synthase
Ligand
BDBM50253611
Substrate
Meas. Tech.
ChEMBL_538600 (CHEMBL1027390)
IC50
19±n/a nM
Citation
 Gangjee, AAdair, OOPagley, MQueener, SF N9-substituted 2,4-diaminoquinazolines: synthesis and biological evaluation of lipophilic inhibitors of pneumocystis carinii and toxoplasma gondii dihydrofolate reductase. J Med Chem 51:6195-200 (2008)  
Target
Name:
Bifunctional dihydrofolate reductase-thymidylate synthase
Synonyms:
DHFR-TS Dihydrofolate reductase Dihydrofolate reductase; T. gondii vs rat
Type:
Enzyme
Mol. Mass.:
68757.49
Organism:
Toxoplasma gondii
Description:
Q07422
Residue:
610
  
Inhibitor
Name:
BDBM50253611
Synonyms:
2,4-Diamino-6-[N-(2,3,5-trichlorobenzyl)-N-ethylamino]quinazoline | CHEMBL522543
Type:
Small organic molecule
Emp. Form.:
C17H16Cl3N5
Mol. Mass.:
396.701
SMILES:
CCN(Cc1cc(Cl)cc(Cl)c1Cl)c1ccc2nc(N)nc(N)c2c1
: