Target
Solute carrier family 22 member 1
Ligand
BDBM50026957
Substrate
Meas. Tech.
ChEMBL_534654 (CHEMBL994103)
IC50
89500±n/a nM
Citation
 Ahlin, GKarlsson, JPedersen, JMGustavsson, LLarsson, RMatsson, PNorinder, UBergström, CAArtursson, P Structural requirements for drug inhibition of the liver specific human organic cation transport protein 1. J Med Chem 51:5932-42 (2008)  
Target
Name:
Solute carrier family 22 member 1
Synonyms:
Adrenergic Alpha Organic cation transporter 1 SLC22A1 hOCT1
Type:
Enzyme Catalytic Domain
Mol. Mass.:
61154.85
Organism:
Homo sapiens (Human)
Description:
Adrenergic Alpha 0 HUMAN::O15245
Residue:
554
  
Inhibitor
Name:
BDBM50026957
Synonyms:
(cis) 2-{4-[3-(2-Trifluoromethyl-thioxanthen-9-ylidene)-propyl]-piperazin-1-yl}-ethanol(Flupentixol) 2-(4-{3-[2-Trifluoromethyl-thioxanthen-(9E)-ylidene]-propyl}-piperazin-1-yl)-ethanol FLUPENTHIXOL, Alpha Flupenthixol | Flupenthixol, Beta
Type:
Small organic molecule
Emp. Form.:
C23H25F3N2OS
Mol. Mass.:
434.518
SMILES:
OCCN1CCN(CC\C=C2/c3ccccc3Sc3ccc(cc23)C(F)(F)F)CC1
: