Target
Solute carrier family 22 member 1
Ligand
BDBM87351
Substrate
Meas. Tech.
ChEMBL_534654 (CHEMBL994103)
IC50
5000±n/a nM
Citation
 Ahlin, GKarlsson, JPedersen, JMGustavsson, LLarsson, RMatsson, PNorinder, UBergström, CAArtursson, P Structural requirements for drug inhibition of the liver specific human organic cation transport protein 1. J Med Chem 51:5932-42 (2008)  
Target
Name:
Solute carrier family 22 member 1
Synonyms:
Adrenergic Alpha Organic cation transporter 1 SLC22A1 hOCT1
Type:
Enzyme Catalytic Domain
Mol. Mass.:
61154.85
Organism:
Homo sapiens (Human)
Description:
Adrenergic Alpha 0 HUMAN::O15245
Residue:
554
  
Inhibitor
Name:
BDBM87351
Synonyms:
Amsacrine hydrochloride MLS002153376 N-[4-(acridin-9-ylamino)-3-methoxy-phenyl]methanesulfonamide;hydrochloride N-[4-(acridin-9-ylamino)-3-methoxyphenyl]methanesulfonamide;hydrochloride cid_148673 | m-AMSA
Type:
Small organic molecule
Emp. Form.:
C21H19N3O3S
Mol. Mass.:
393.459
SMILES:
COc1cc(NS(C)(=O)=O)ccc1Nc1c2ccccc2nc2ccccc12
: