Target
Insulin receptor
Ligand
BDBM50253180
Substrate
Meas. Tech.
ChEMBL_538724 (CHEMBL1035035)
EC50
43000±n/a nM
Citation
 Lum, RTCheng, MCristobal, CPGoldfine, IDEvans, JLKeck, JGMacsata, RWManchem, VPMatsumoto, YPark, SJRao, SSRobinson, LShi, SSpevak, WRSchow, SR Design, synthesis, and structure-activity relationships of novel insulin receptor tyrosine kinase activators. J Med Chem 51:6173-87 (2008)  
Target
Name:
Insulin receptor
Synonyms:
CD_antigen=CD220 IR Insulin receptor subunit alpha | Insulin receptor subunit beta
Type:
PROTEIN
Mol. Mass.:
155593.32
Organism:
Mus musculus
Description:
ChEMBL_305383
Residue:
1372
  
Inhibitor
Name:
BDBM50253180
Synonyms:
5-{[(7-{[(7-{[(3-Carboxy-4-hydroxyphenyl)amino]sulfonyl}-5-hydroxy(2-naphthyl))amino]carbonylamino}-4-hydroxy(2-naphthyl))-sulfonyl]amino}-2-hydroxybenzoic Acid | CHEMBL510360
Type:
Small organic molecule
Emp. Form.:
C35H26N4O13S2
Mol. Mass.:
774.73
SMILES:
OC(=O)c1cc(NS(=O)(=O)c2cc(O)c3ccc(NC(=O)Nc4ccc5c(O)cc(cc5c4)S(=O)(=O)Nc4ccc(O)c(c4)C(O)=O)cc3c2)ccc1O
: