Target
Dihydrofolate reductase
Ligand
BDBM18796
Substrate
Meas. Tech.
ChEMBL_539765 (CHEMBL1034983)
IC50
230000±n/a nM
Citation
 Gangjee, AQiu, YLi, WKisliuk, RL Potent dual thymidylate synthase and dihydrofolate reductase inhibitors: classical and nonclassical 2-amino-4-oxo-5-arylthio-substituted-6-methylthieno[2,3-d]pyrimidine antifolates. J Med Chem 51:5789-97 (2008)  
Target
Name:
Dihydrofolate reductase
Synonyms:
Dihydrofolate reductase (F31V) | dfrA17
Type:
Mol. Mass.:
17532.46
Organism:
Escherichia coli
Description:
Residue:
157
  
Inhibitor
Name:
BDBM18796
Synonyms:
(2S)-2-{[4-(2-{2-amino-4-oxo-1H,4H,7H-pyrrolo[2,3-d]pyrimidin-5-yl}ethyl)phenyl]formamido}pentanedioic acid Pemetrexed
Type:
Small organic molecule
Emp. Form.:
C20H21N5O6
Mol. Mass.:
427.4106
SMILES:
Nc1nc2[nH]cc(CCc3ccc(cc3)C(=O)N[C@@H](CCC(O)=O)C(O)=O)c2c(=O)[nH]1
: