Target
Glutamate receptor 2
Ligand
BDBM50252921
Substrate
Meas. Tech.
ChEMBL_539472 (CHEMBL1028968)
Ki
126±n/a nM
Citation
 Butini, SPickering, DSMorelli, ECoccone, SSTrotta, FDe Angelis, MGuarino, EFiorini, ICampiani, GNovellino, ESchousboe, AChristensen, JKGemma, S 1H-cyclopentapyrimidine-2,4(1H,3H)-dione-related ionotropic glutamate receptors ligands. structure-activity relationships and identification of potent and Selective iGluR5 modulators. J Med Chem 51:6614-8 (2008)  
Target
Name:
Glutamate receptor 2
Synonyms:
GRIA2_RAT Glutamate receptor AMPA 2/4 Gria2
Type:
PROTEIN
Mol. Mass.:
98691.74
Organism:
Rattus norvegicus
Description:
ChEMBL_936441
Residue:
883
  
Inhibitor
Name:
BDBM50252921
Synonyms:
(S)-1-(2'-Amino-2'-carboxyethyl)-6,6-dimethyl-2,3,4,5,6,7-hexahydrocyclopentapyrimidin-2,4-dione | CHEMBL492629
Type:
Small organic molecule
Emp. Form.:
C12H17N3O4
Mol. Mass.:
267.2811
SMILES:
CC1(C)Cc2c(C1)c(=O)[nH]c(=O)n2C[C@H](N)C(O)=O
: