Target
Glutamate receptor 2
Ligand
BDBM50061058
Substrate
Meas. Tech.
ChEMBL_539472 (CHEMBL1028968)
Ki
1220±n/a nM
Citation
 Butini, SPickering, DSMorelli, ECoccone, SSTrotta, FDe Angelis, MGuarino, EFiorini, ICampiani, GNovellino, ESchousboe, AChristensen, JKGemma, S 1H-cyclopentapyrimidine-2,4(1H,3H)-dione-related ionotropic glutamate receptors ligands. structure-activity relationships and identification of potent and Selective iGluR5 modulators. J Med Chem 51:6614-8 (2008)  
Target
Name:
Glutamate receptor 2
Synonyms:
GRIA2_RAT Glutamate receptor AMPA 2/4 Gria2
Type:
PROTEIN
Mol. Mass.:
98691.74
Organism:
Rattus norvegicus
Description:
ChEMBL_936441
Residue:
883
  
Inhibitor
Name:
BDBM50061058
Synonyms:
2-Amino-3-(2,4-dihydroxy-pyrimidin-1-yl)-propionic acid(DL-willardiine) CHEMBL366489
Type:
Small organic molecule
Emp. Form.:
C7H9N3O4
Mol. Mass.:
199.1641
SMILES:
NC(Cn1ccc(=O)[nH]c1=O)C(O)=O
: