Target
Fatty-acid amide hydrolase 1
Ligand
BDBM50204511
Substrate
Meas. Tech.
ChEMBL_494689 (CHEMBL938648)
Ki
2±n/a nM
Citation
 Seierstad, MBreitenbucher, JG Discovery and development of fatty acid amide hydrolase (FAAH) inhibitors. J Med Chem 51:7327-43 (2009)  
Target
Name:
Fatty-acid amide hydrolase 1
Synonyms:
Anandamide amidohydrolase FAAH FAAH1_HUMAN Fatty-acid amide hydrolase (FAAH) Oleamide hydrolase 1
Type:
Protein
Mol. Mass.:
63071.19
Organism:
Homo sapiens (Human)
Description:
O00519
Residue:
579
  
Inhibitor
Name:
BDBM50204511
Synonyms:
3-(2-(7-phenylheptanoyl)oxazol-5-yl)benzenesulfonamide | CHEMBL374895
Type:
Small organic molecule
Emp. Form.:
C22H24N2O4S
Mol. Mass.:
412.502
SMILES:
NS(=O)(=O)c1cccc(c1)-c1cnc(o1)C(=O)CCCCCCc1ccccc1
: