Target
Fatty-acid amide hydrolase 1
Ligand
BDBM50228828
Substrate
Meas. Tech.
ChEMBL_494689 (CHEMBL938648)
Ki
6.90±n/a nM
Citation
 Seierstad, MBreitenbucher, JG Discovery and development of fatty acid amide hydrolase (FAAH) inhibitors. J Med Chem 51:7327-43 (2009)  
Target
Name:
Fatty-acid amide hydrolase 1
Synonyms:
Anandamide amidohydrolase FAAH FAAH1_HUMAN Fatty-acid amide hydrolase (FAAH) Oleamide hydrolase 1
Type:
Protein
Mol. Mass.:
63071.19
Organism:
Homo sapiens (Human)
Description:
O00519
Residue:
579
  
Inhibitor
Name:
BDBM50228828
Synonyms:
1-(oxazolo[4,5-b]pyridin-2-yl)-4-phenylbutan-1-one | CHEMBL257638
Type:
Small organic molecule
Emp. Form.:
C16H14N2O2
Mol. Mass.:
266.2946
SMILES:
O=C(CCCc1ccccc1)c1nc2ncccc2o1
: