Target
Small conductance calcium-activated potassium channel protein 3
Ligand
BDBM50275152
Substrate
Meas. Tech.
ChEMBL_494975 (CHEMBL1008047)
Kd
750±n/a nM
Citation
 Sørensen, USStrøbaek, DChristophersen, PHougaard, CJensen, MLNielsen, EŘPeters, DTeuber, L Synthesis and structure-activity relationship studies of 2-(N-substituted)-aminobenzimidazoles as potent negative gating modulators ofsmall conductance Ca2+-activated K+ channels. J Med Chem 51:7625-34 (2009)  
Target
Name:
Small conductance calcium-activated potassium channel protein 3
Synonyms:
KCNN3_RAT SK3 | Small conductance calcium-activated potassium channel
Type:
PROTEIN
Mol. Mass.:
81476.29
Organism:
Rattus norvegicus
Description:
ChEMBL_494975
Residue:
732
  
Inhibitor
Name:
BDBM50275152
Synonyms:
2-(2-Phenylpiperidin-1-yl)-1H-benzoimidazole | CHEMBL507161
Type:
Small organic molecule
Emp. Form.:
C18H19N3
Mol. Mass.:
277.3636
SMILES:
C1CCN(C(C1)c1ccccc1)c1nc2ccccc2[nH]1
: