Target
D(2) dopamine receptor
Ligand
BDBM50275320
Substrate
Meas. Tech.
ChEMBL_496148 (CHEMBL1000137)
Ki
2120±n/a nM
Citation
 Berardi, FAbate, CFerorelli, Sde Robertis, AFLeopoldo, MColabufo, NANiso, MPerrone, R Novel 4-(4-aryl)cyclohexyl-1-(2-pyridyl)piperazines as Delta(8)-Delta(7) sterol isomerase (emopamil binding protein) selective ligands with antiproliferative activity. J Med Chem 51:7523-31 (2009)  
Target
Name:
D(2) dopamine receptor
Synonyms:
DOPAMINE D2 DOPAMINE D2 Short Dopamine D2 receptor Drd2
Type:
G Protein-Coupled Receptor (GPCR)
Mol. Mass.:
50931.60
Organism:
Rattus norvegicus (rat)
Description:
P61169
Residue:
444
  
Inhibitor
Name:
BDBM50275320
Synonyms:
CHEMBL485729 | cis-1-(4-(2-methoxyphenyl)cyclohexyl)-4-(pyridin-2-yl)piperazine
Type:
Small organic molecule
Emp. Form.:
C22H29N3O
Mol. Mass.:
351.4852
SMILES:
COc1ccccc1[C@@H]1CC[C@@H](CC1)N1CCN(CC1)c1ccccn1
: