Target
3-beta-hydroxysteroid-Delta(8),Delta(7)-isomerase
Ligand
BDBM50275280
Substrate
Meas. Tech.
ChEMBL_496150 (CHEMBL1000139)
Ki
24±n/a nM
Citation
 Berardi, FAbate, CFerorelli, Sde Robertis, AFLeopoldo, MColabufo, NANiso, MPerrone, R Novel 4-(4-aryl)cyclohexyl-1-(2-pyridyl)piperazines as Delta(8)-Delta(7) sterol isomerase (emopamil binding protein) selective ligands with antiproliferative activity. J Med Chem 51:7523-31 (2009)  
Target
Name:
3-beta-hydroxysteroid-Delta(8),Delta(7)-isomerase
Synonyms:
EBP | EBP_CAVPO
Type:
PROTEIN
Mol. Mass.:
26684.52
Organism:
Cavia porcellus
Description:
ChEMBL_203193
Residue:
229
  
Inhibitor
Name:
BDBM50275280
Synonyms:
CHEMBL487359 | cis-4-(3-methoxyphenyl)-N-(2-(pyridin-2-yloxy)ethyl)cyclohexanamine
Type:
Small organic molecule
Emp. Form.:
C20H26N2O2
Mol. Mass.:
326.4326
SMILES:
COc1cccc(c1)[C@@H]1CC[C@@H](CC1)NCCOc1ccccn1
: