Target
Multifunctional protein ADE2
Ligand
BDBM50247824
Substrate
Meas. Tech.
ChEMBL_495249 (CHEMBL1003655)
Ki
390±n/a nM
Citation
 Firestine, SMWu, WYoun, HDavisson, VJ Interrogating the mechanism of a tight binding inhibitor of AIR carboxylase. Bioorg Med Chem 17:794-803 (2009)  
Target
Name:
Multifunctional protein ADE2
Synonyms:
AIRC | PUR6_CHICK
Type:
PROTEIN
Mol. Mass.:
47244.84
Organism:
Gallus gallus
Description:
ChEMBL_495249
Residue:
426
  
Inhibitor
Name:
BDBM50247824
Synonyms:
5-Amino-1-(beta-D-ribofuranosyl)-4-nitropyrazole 5'-phosphate | CHEMBL554752
Type:
Small organic molecule
Emp. Form.:
C8H11N4O9P
Mol. Mass.:
338.1692
SMILES:
Nc1c(cnn1[C@@H]1O[C@H](COP([O-])([O-])=O)[C@@H](O)[C@H]1O)[N+]([O-])=O
: