Target
ATP-binding cassette sub-family C member 9
Ligand
BDBM50062397
Substrate
Meas. Tech.
ChEMBL_495672 (CHEMBL1006149)
EC50
230±n/a nM
Citation
 Zhang, XQiu, YLi, XBhattacharjee, SWoods, MKraft, PLundeen, SGSui, Z Discovery and structure-activity relationships of a novel series of benzopyran-based K(ATP) openers for urge urinary incontinence. Bioorg Med Chem 17:855-66 (2009)  
Target
Name:
ATP-binding cassette sub-family C member 9
Synonyms:
ABCC9 ATP-binding cassette transporter sub-family C member 9 Sulfonylurea receptor 2 | Sulfonylurea receptor 2, Kir6.2
Type:
PROTEIN
Mol. Mass.:
174236.59
Organism:
Homo sapiens (Human)
Description:
ChEMBL_495672
Residue:
1549
  
Inhibitor
Name:
BDBM50062397
Synonyms:
3N-cyanoimino(tert-pentylamino)methyl-3-pyridinamine CHEMBL11458 N-cyano-N''-(1,1-dimethylpropyl)-N'-pyridin-3-ylguanidine | P-1075
Type:
Small organic molecule
Emp. Form.:
C12H17N5
Mol. Mass.:
231.2969
SMILES:
CCC(C)(C)NC(NC#N)=Nc1cccnc1
: