Target
ATP-binding cassette sub-family C member 9
Ligand
BDBM50247833
Substrate
Meas. Tech.
ChEMBL_495672 (CHEMBL1006149)
EC50
1080±n/a nM
Citation
 Zhang, XQiu, YLi, XBhattacharjee, SWoods, MKraft, PLundeen, SGSui, Z Discovery and structure-activity relationships of a novel series of benzopyran-based K(ATP) openers for urge urinary incontinence. Bioorg Med Chem 17:855-66 (2009)  
Target
Name:
ATP-binding cassette sub-family C member 9
Synonyms:
ABCC9 ATP-binding cassette transporter sub-family C member 9 Sulfonylurea receptor 2 | Sulfonylurea receptor 2, Kir6.2
Type:
PROTEIN
Mol. Mass.:
174236.59
Organism:
Homo sapiens (Human)
Description:
ChEMBL_495672
Residue:
1549
  
Inhibitor
Name:
BDBM50247833
Synonyms:
(3S,4R)-6-Chloro-2-[3-hydroxy-2,2-dimethyl-6-(piperidine-1-sulfonyl)-chroman-4-yl]-benzo[d] isoxazol-3-one | CHEMBL523312
Type:
Small organic molecule
Emp. Form.:
C23H25ClN2O6S
Mol. Mass.:
492.972
SMILES:
CC1(C)Oc2ccc(cc2[C@H]([C@@H]1O)n1oc2cc(Cl)ccc2c1=O)S(=O)(=O)N1CCCCC1
: