Target
Histone acetyltransferase KAT5
Ligand
BDBM50292429
Substrate
Meas. Tech.
ChEMBL_515391 (CHEMBL1025546)
IC50
374590±n/a nM
Citation
 Wu, JXie, NWu, ZZhang, YZheng, YG Bisubstrate Inhibitors of the MYST HATs Esa1 and Tip60. Bioorg Med Chem 17:1381-6 (2009)  
Target
Name:
Histone acetyltransferase KAT5
Synonyms:
HTATIP KAT5_HUMAN | TIP60
Type:
PROTEIN
Mol. Mass.:
58595.98
Organism:
Homo sapiens (Human)
Description:
ChEMBL_796787
Residue:
513
  
Inhibitor
Name:
BDBM50292429
Synonyms:
2-Hydroxy-6-pentadecyl-benzoic acid 2-hydroxy-6-((8Z,11Z)-pentadeca-8,11,14-trienyl)benzoic acid 6-[8(Z),11(Z),14-pentadecatrienyl]salicylic acid 6-pentadecylsalicylic acid 6[8'(Z ),11'(Z ),14'-pentadecatrienyl]salicylicacid CHEMBL455368 | anacardic acid
Type:
Small organic molecule
Emp. Form.:
C22H30O3
Mol. Mass.:
342.4718
SMILES:
OC(=O)c1c(O)cccc1CCCCCCC\C=C/C\C=C/CC=C
: