Target
Ryanodine receptor 1
Ligand
BDBM50191280
Substrate
Meas. Tech.
ChEMBL_497239 (CHEMBL1006192)
IC50
6000±n/a nM
Citation
 Zieminska, ELazarewicz, JWCouladouros, EAMoutsos, VIPitsinos, EN Open-chain half-bastadins mimic the effects of cyclic bastadins on calcium homeostasis in cultured neurons. Bioorg Med Chem Lett 18:5734-7 (2009)  
Target
Name:
Ryanodine receptor 1
Synonyms:
RYDR RYR1 Skeletal muscle calcium release channel Skeletal muscle-type ryanodine receptor | Type 1 ryanodine receptor
Type:
PROTEIN
Mol. Mass.:
565027.60
Organism:
Homo sapiens (Human)
Description:
ChEMBL_196055
Residue:
5038
  
Inhibitor
Name:
BDBM50191280
Synonyms:
5,21-Dibromo-4-hydroxy-2-oxa-10,14-diaza-tricyclo[16.2.2.1*3,7*]tricosa-1(21),3,5,7(23),18(22),19-hexaene-11,15-dione CHEMBL213853
Type:
Small organic molecule
Emp. Form.:
C20H20Br2N2O4
Mol. Mass.:
512.192
SMILES:
Oc1c(Br)cc2CCNC(=O)CCNC(=O)CCc3ccc(Oc1c2)c(Br)c3
: