Target
Epidermal growth factor receptor
Ligand
BDBM50265033
Substrate
Meas. Tech.
ChEMBL_497088 (CHEMBL998566)
IC50
>25000±n/a nM
Citation
 Baldwin, IBamborough, PHaslam, CGHunjan, SSLongstaff, TMooney, CJPatel, SQuinn, JSomers, DO Kinase array design, back to front: biaryl amides. Bioorg Med Chem Lett 18:5285-9 (2008)  
Target
Name:
Epidermal growth factor receptor
Synonyms:
EGF Receptor Substrate EGFR_HUMAN ERBB1 Epidermal Growth Factor Receptor erbB-1 Epidermal growth factor receptor (EGFR) HER1 Proto-oncogene c-ErbB-1 Tyrosine-Protein Kinase ErbB-1
Type:
Receptor Kinase Domain
Mol. Mass.:
134279.59
Organism:
Homo sapiens (Human)
Description:
P00533
Residue:
1210
  
Inhibitor
Name:
BDBM50265033
Synonyms:
CHEMBL522579 | N-cyclopropyl-2',6-dimethyl-4'-(5-methyl-1,3,4-oxadiazol-2-yl)biphenyl-3-carboxamide
Type:
Small organic molecule
Emp. Form.:
C21H21N3O2
Mol. Mass.:
347.4103
SMILES:
Cc1nnc(o1)-c1ccc(c(C)c1)-c1cc(ccc1C)C(=O)NC1CC1
: