Target
Serine/threonine-protein kinase Sgk1
Ligand
BDBM50265259
Substrate
Meas. Tech.
ChEMBL_497093 (CHEMBL998571)
IC50
>33000±n/a nM
Citation
 Baldwin, IBamborough, PHaslam, CGHunjan, SSLongstaff, TMooney, CJPatel, SQuinn, JSomers, DO Kinase array design, back to front: biaryl amides. Bioorg Med Chem Lett 18:5285-9 (2008)  
Target
Name:
Serine/threonine-protein kinase Sgk1
Synonyms:
SGK SGK1_HUMAN Serine/threonine-protein kinase Sgk1 (SGK) Serum/glucocorticoid-regulated kinase 1 (SGK1)
Type:
Other Protein Type
Mol. Mass.:
48954.40
Organism:
Homo sapiens (Human)
Description:
Recombinant human SGK-1 enzyme produced in a baculovirus system.
Residue:
431
  
Inhibitor
Name:
BDBM50265259
Synonyms:
CHEMBL526639 | N-cyclopropyl-3-(isoquinolin-7-yl)-4-methylbenzamide
Type:
Small organic molecule
Emp. Form.:
C20H18N2O
Mol. Mass.:
302.3697
SMILES:
Cc1ccc(cc1-c1ccc2ccncc2c1)C(=O)NC1CC1
: