Target
Cation-dependent mannose-6-phosphate receptor
Ligand
BDBM50275809
Substrate
Meas. Tech.
ChEMBL_492874 (CHEMBL942205)
IC50
71000±n/a nM
Citation
 Jeanjean, AGary-Bobo, MNirdé, PLeiris, SGarcia, MMorère, A Synthesis of new sulfonate and phosphonate derivatives for cation-independent mannose 6-phosphate receptor targeting. Bioorg Med Chem Lett 18:6240-3 (2008)  
Target
Name:
Cation-dependent mannose-6-phosphate receptor
Synonyms:
M6PR MPRD | MPRD_HUMAN
Type:
PROTEIN
Mol. Mass.:
30989.41
Organism:
Homo sapiens (Human)
Description:
ChEMBL_492874
Residue:
277
  
Inhibitor
Name:
BDBM50275809
Synonyms:
CHEMBL470778 | sodium 2-((2R,3S,4S,5S,6S)-3,4,5-trihydroxy-6-methoxytetrahydro-2H-pyran-2-yl)ethenesulfonate
Type:
Small organic molecule
Emp. Form.:
C8H13O8S
Mol. Mass.:
269.25
SMILES:
CO[C@H]1O[C@H](\C=C\S([O-])(=O)=O)[C@@H](O)[C@H](O)[C@@H]1O
: