Target
Sodium-dependent dopamine transporter
Ligand
BDBM50366567
Substrate
Meas. Tech.
ChEMBL_493242 (CHEMBL948472)
IC50
3100±n/a nM
Citation
 Dyck, BTamiya, JJovic, FPick, RRBradbury, MJO'Brien, JWen, JJohns, MMadan, AFleck, BAFoster, ACLi, BZhang, MTran, JAVickers, TGrey, JSaunders, JChen, C Characterization of thien-2-yl 1S,2R-milnacipran analogues as potent norepinephrine/serotonin transporter inhibitors for the treatment of neuropathic pain. J Med Chem 51:7265-72 (2009)  
Target
Name:
Sodium-dependent dopamine transporter
Synonyms:
DA transporter DAT1 Dopamine transporter protein (DAT) SC6A3_HUMAN Sodium-dependent dopamine transporter Solute carrier family 6 member 3
Type:
Multi-pass membrane protein
Mol. Mass.:
68497.11
Organism:
Homo sapiens (Human)
Description:
Q01959
Residue:
620
  
Inhibitor
Name:
BDBM50366567
Synonyms:
ATOMOXETINE
Type:
Small organic molecule
Emp. Form.:
C17H21NO
Mol. Mass.:
255.3547
SMILES:
CNCC[C@@H](Oc1ccccc1C)c1ccccc1
: