Target
Sodium-dependent dopamine transporter
Ligand
BDBM50275830
Substrate
Meas. Tech.
ChEMBL_493242 (CHEMBL948472)
IC50
>10000±n/a nM
Citation
 Dyck, BTamiya, JJovic, FPick, RRBradbury, MJO'Brien, JWen, JJohns, MMadan, AFleck, BAFoster, ACLi, BZhang, MTran, JAVickers, TGrey, JSaunders, JChen, C Characterization of thien-2-yl 1S,2R-milnacipran analogues as potent norepinephrine/serotonin transporter inhibitors for the treatment of neuropathic pain. J Med Chem 51:7265-72 (2009)  
Target
Name:
Sodium-dependent dopamine transporter
Synonyms:
DA transporter DAT1 Dopamine transporter protein (DAT) SC6A3_HUMAN Sodium-dependent dopamine transporter Solute carrier family 6 member 3
Type:
Multi-pass membrane protein
Mol. Mass.:
68497.11
Organism:
Homo sapiens (Human)
Description:
Q01959
Residue:
620
  
Inhibitor
Name:
BDBM50275830
Synonyms:
CHEMBL513248 | N,N-Dipropargyl (1R,2R)-2-(Aminomethyl)-1-(2-thienyl)cyclopropanecarboxamide
Type:
Small organic molecule
Emp. Form.:
C15H16N2OS
Mol. Mass.:
272.365
SMILES:
NC[C@@H]1C[C@@]1(C(=O)N(CC#C)CC#C)c1cccs1
: