Target
Amine oxidase [flavin-containing] A
Ligand
BDBM50276189
Substrate
Meas. Tech.
ChEMBL_543072 (CHEMBL1022171)
Ki
420±n/a nM
Citation
 Vilches-Herrera, MMiranda-Sepúlveda, JRebolledo-Fuentes, MFierro, ALühr, SIturriaga-Vasquez, PCassels, BKReyes-Parada, M Naphthylisopropylamine and N-benzylamphetamine derivatives as monoamine oxidase inhibitors. Bioorg Med Chem 17:2452-60 (2009)  
Target
Name:
Amine oxidase [flavin-containing] A
Synonyms:
AOFA_RAT Amine oxidase [flavin-containing] A Monoamine Oxidase Type A (MAO-A) Monoamine oxidase A (MAO-A) Monoamine oxidase type A (MAOA)
Type:
Enzyme
Mol. Mass.:
59515.21
Organism:
Rattus norvegicus (rat)
Description:
Residue:
526
  
Inhibitor
Name:
BDBM50276189
Synonyms:
1-(2-Naphthyl)-2-aminopropane | CHEMBL471839
Type:
Small organic molecule
Emp. Form.:
C13H15N
Mol. Mass.:
185.2649
SMILES:
CC(N)Cc1ccc2ccccc2c1
: