Target
Glyceraldehyde-3-phosphate dehydrogenase, glycosomal
Ligand
BDBM50249049
Substrate
Meas. Tech.
ChEMBL_543345 (CHEMBL1023015)
IC50
81000±n/a nM
Citation
 Freitas, RFProkopczyk, IMZottis, AOliva, GAndricopulo, ADTrevisan, MTVilegas, WSilva, MGMontanari, CA Discovery of novel Trypanosoma cruzi glyceraldehyde-3-phosphate dehydrogenase inhibitors. Bioorg Med Chem 17:2476-82 (2009)  
Target
Name:
Glyceraldehyde-3-phosphate dehydrogenase, glycosomal
Synonyms:
G3PG_TRYCR
Type:
PROTEIN
Mol. Mass.:
39070.68
Organism:
Trypanosoma cruzi
Description:
ChEMBL_973242
Residue:
359
  
Inhibitor
Name:
BDBM50249049
Synonyms:
6,7-dimethoxy-2-(3,4,5-trimethoxyphenyl)-4H-chromen-4-one | CHEMBL474167
Type:
Small organic molecule
Emp. Form.:
C20H20O7
Mol. Mass.:
372.3686
SMILES:
COc1cc2oc(cc(=O)c2cc1OC)-c1cc(OC)c(OC)c(OC)c1
: