Target
11-beta-hydroxysteroid dehydrogenase 1
Ligand
BDBM50413278
Substrate
Meas. Tech.
ChEMBL_543487 (CHEMBL1018653)
IC50
3.3±n/a nM
Citation
 McMinn, DLRew, YSudom, ACaille, SDegraffenreid, MHe, XHungate, RJiang, BJaen, JJulian, LDKaizerman, JNovak, PSun, DTu, HUrsu, SWalker, NPYan, XYe, QWang, ZPowers, JP Optimization of novel di-substituted cyclohexylbenzamide derivatives as potent 11 beta-HSD1 inhibitors. Bioorg Med Chem Lett 19:1446-50 (2009)  
Target
Name:
11-beta-hydroxysteroid dehydrogenase 1
Synonyms:
11-DH 11-beta-Hydroxysteroid Dehydrogenase 1 (11-beta-HSD1) 11-beta-hydroxysteroid dehydrogenase 1 (11HSD1) Corticosteroid 11-beta-dehydrogenase isozyme 1 (11-beta-HSD-1) Corticosteroid 11-beta-dehydrogenase isozyme 1 (11beta-HSD1) HSD11 HSD11L | SDR26C1
Type:
Enzyme
Mol. Mass.:
32409.16
Organism:
Homo sapiens (Human)
Description:
P28845
Residue:
292
  
Inhibitor
Name:
BDBM50413278
Synonyms:
CHEMBL2021499
Type:
Small organic molecule
Emp. Form.:
C26H26F4N2O2
Mol. Mass.:
474.4905
SMILES:
C[C@@](O)(c1ccc(cc1)C(=O)N(C1CC1)[C@H]1CC[C@](CC1)(C#N)c1ccc(F)cc1)C(F)(F)F
: