Target
C-C chemokine receptor type 5
Ligand
BDBM50248323
Substrate
Meas. Tech.
ChEMBL_543512 (CHEMBL1019461)
IC50
0.513±n/a nM
Citation
 Barber, CGBlakemore, DCChiva, JYEastwood, RLMiddleton, DSParadowski, KA 1-Amido-1-phenyl-3-piperidinylbutanes--CCR5 antagonists for the treatment of HIV: part 2. Bioorg Med Chem Lett 19:1499-503 (2009)  
Target
Name:
C-C chemokine receptor type 5
Synonyms:
C-C CKR-5 CC-CKR-5 CCR5 CCR5_HUMAN CHEMR13 HIV-1 fusion coreceptor
Type:
Enzyme
Mol. Mass.:
40540.21
Organism:
Homo sapiens (Human)
Description:
P51681
Residue:
352
  
Inhibitor
Name:
BDBM50248323
Synonyms:
(+/-)-N-((1S)-3-(4-(3-isopropyl-5-methyl-4H-1,2,4-triazol-4-yl)piperidin-1-yl)-1-phenylbutyl)cyclohexanecarboxamide | CHEMBL473759
Type:
Small organic molecule
Emp. Form.:
C28H43N5O
Mol. Mass.:
465.6739
SMILES:
CC(C)c1nnc(C)n1C1CCN(CC1)C(C)C[C@H](NC(=O)C1CCCCC1)c1ccccc1
: