Target
Adenosine receptor A2a
Ligand
BDBM50009685
Substrate
Meas. Tech.
ChEMBL_566530 (CHEMBL955116)
Ki
6900±n/a nM
Citation
 Lambertucci, CAntonini, IBuccioni, MDal Ben, DKachare, DDVolpini, RKlotz, KNCristalli, G 8-Bromo-9-alkyl adenine derivatives as tools for developing new adenosine A2A and A2B receptors ligands. Bioorg Med Chem 17:2812-22 (2009)  
Target
Name:
Adenosine receptor A2a
Synonyms:
A2A adenosine receptor (hA2A) ADENOSINE A2 ADORA2 Adenosine A2A receptor (A2AAR)
Type:
G Protein-Coupled Receptor (GPCR)
Mol. Mass.:
44716.46
Organism:
Homo sapiens (Human)
Description:
P29274
Residue:
412
  
Inhibitor
Name:
BDBM50009685
Synonyms:
9-METHYL-9H-PURIN-6-AMINE 9-Methyl-9H-purin-6-ylamine | CHEMBL65976
Type:
Small organic molecule
Emp. Form.:
C6H7N5
Mol. Mass.:
149.1533
SMILES:
Cn1cnc2c(N)ncnc12
: