Target
Cyclin-dependent protein kinase PHO85
Ligand
BDBM50113707
Substrate
Meas. Tech.
ChEMBL_563813 (CHEMBL994325)
IC50
2000±n/a nM
Citation
 Gray, NSWodicka, LThunnissen, AMNorman, TCKwon, SEspinoza, FHMorgan, DOBarnes, GLeClerc, SMeijer, LKim, SHLockhart, DJSchultz, PG Exploiting chemical libraries, structure, and genomics in the search for kinase inhibitors. Science 281:533-538 (1998)  
Target
Name:
Cyclin-dependent protein kinase PHO85
Synonyms:
Cyclin-dependent protein kinase PHO85 PHO85_YEAST SSG3
Type:
PROTEIN
Mol. Mass.:
34912.85
Organism:
Saccharomyces cerevisiae
Description:
ChEMBL_563813
Residue:
305
  
Inhibitor
Name:
BDBM50113707
Synonyms:
2,6,9-Trisubstitute purine, 2 2-[6-(3-Chloro-phenylamino)-9-isopropyl-9H-purin-2-ylamino]-ethanol | CHEMBL311228
Type:
Small organic molecule
Emp. Form.:
C16H19ClN6O
Mol. Mass.:
346.815
SMILES:
CC(C)n1cnc2c(Nc3cccc(Cl)c3)nc(NCCO)nc12
: