Target
Mu-type opioid receptor
Ligand
BDBM50367123
Substrate
Meas. Tech.
ChEMBL_563706 (CHEMBL992670)
Ki
0.14±n/a nM
Citation
 Yang, LXu, WChen, FLiu-Chen, LYMa, ZLee, DY Synthesis and biological evaluation of C-12 triazole and oxadiazole analogs of salvinorin A. Bioorg Med Chem Lett 19:1301-4 (2009)  
Target
Name:
Mu-type opioid receptor
Synonyms:
MOR-1 Mu-type opioid receptor (MOR) OPRM_RAT Opioid receptor B Ror-b
Type:
G Protein-Coupled Receptor (GPCR)
Mol. Mass.:
44503.11
Organism:
Rattus norvegicus (rat)
Description:
Competition binding assays were carried out using membrane preparations from transfected HN9.10 cells that constitutively expressed the mu opioid receptor.
Residue:
398
  
Inhibitor
Name:
BDBM50367123
Synonyms:
ETORPHINE | M99
Type:
Small organic molecule
Emp. Form.:
C24H31NO4
Mol. Mass.:
397.5072
SMILES:
CCC[C@](C)(O)[C@H]1C[C@]23C=C[C@]1(O)[C@@H]1Oc4c5c(C[C@H]2N(C)CC[C@@]315)ccc4O
: