Target
Kappa-type opioid receptor
Ligand
BDBM50278385
Substrate
Meas. Tech.
ChEMBL_565189 (CHEMBL958395)
IC50
13±n/a nM
Citation
 Wentland, MPLou, RLu, QBu, YDenhardt, CJin, JGanorkar, RVanAlstine, MAGuo, CCohen, DJBidlack, JM Syntheses of novel high affinity ligands for opioid receptors. Bioorg Med Chem Lett 19:2289-94 (2009)  
Target
Name:
Kappa-type opioid receptor
Synonyms:
K-OR-1 Kappa-opioid receptor (KOR) Kappa-type opioid receptor (KOR) OPIATE Kappa OPRK1 kappa opioid receptor (KOR)
Type:
G Protein-Coupled Receptor (GPCR)
Mol. Mass.:
42648.76
Organism:
Homo sapiens (Human)
Description:
P41145
Residue:
380
  
Inhibitor
Name:
BDBM50278385
Synonyms:
6-desoxonaltrexone | CHEMBL511816
Type:
Small organic molecule
Emp. Form.:
C20H25NO3
Mol. Mass.:
327.4174
SMILES:
Oc1ccc2C[C@H]3N(CC4CC4)CC[C@]45[C@H](CCC[C@@]34O)Oc1c25
: