Target
Aurora kinase B
Ligand
BDBM12984
Substrate
Meas. Tech.
ChEMBL_501649 (CHEMBL993739)
IC50
99±n/a nM
Citation
 Pollard, JRMortimore, M Discovery and development of aurora kinase inhibitors as anticancer agents. J Med Chem 52:2629-51 (2009)  
Target
Name:
Aurora kinase B
Synonyms:
AIK2 AIM1 ARK2 AURKB_HUMAN Aurora B-INCENP Aurora kinase B (AURKB) STK-1 STK12 Serine/threonine-protein kinase aurora B
Type:
Protein
Mol. Mass.:
39327.72
Organism:
Homo sapiens (Human)
Description:
Q96GD4
Residue:
344
  
Inhibitor
Name:
BDBM12984
Synonyms:
4-(4-methylpiperazin-1-yl)-N-{5-[(2R)-2-phenylpropanoyl]-1H,4H,5H,6H-pyrrolo[3,4-c]pyrazol-3-yl}benzamide CHEMBL427787
Type:
Small organic molecule
Emp. Form.:
C26H30N6O2
Mol. Mass.:
458.5554
SMILES:
C[C@@H](C(=O)N1Cc2n[nH]c(NC(=O)c3ccc(cc3)N3CCN(C)CC3)c2C1)c1ccccc1
: