Target
Aurora kinase B
Ligand
BDBM26274
Substrate
Meas. Tech.
ChEMBL_501683 (CHEMBL981431)
IC50
680±n/a nM
Citation
 Pollard, JRMortimore, M Discovery and development of aurora kinase inhibitors as anticancer agents. J Med Chem 52:2629-51 (2009)  
Target
Name:
Aurora kinase B
Synonyms:
AIK2 AIM1 ARK2 AURKB_HUMAN Aurora B-INCENP Aurora kinase B (AURKB) STK-1 STK12 Serine/threonine-protein kinase aurora B
Type:
Protein
Mol. Mass.:
39327.72
Organism:
Homo sapiens (Human)
Description:
Q96GD4
Residue:
344
  
Inhibitor
Name:
BDBM26274
Synonyms:
CHEMBL216769 pyrazoloquinazoline deriv., 8
Type:
Small organic molecule
Emp. Form.:
C29H34FN7O4
Mol. Mass.:
563.6232
SMILES:
COc1cc2c(Nc3cc(CC(=O)Nc4cccc(F)c4)n[nH]3)ncnc2cc1OCCCN1CCC(CO)CC1
: