Target
Carbonic anhydrase 14
Ligand
BDBM11037
Substrate
Meas. Tech.
ChEMBL_544670 (CHEMBL1009247)
Ki
5±n/a nM
Citation
 Thiry, ARolin, SVullo, DFrankart, AScozzafava, ADogné, JMWouters, JSupuran, CTMasereel, B Indanesulfonamides as carbonic anhydrase inhibitors and anticonvulsant agents: structure-activity relationship and pharmacological evaluation. Eur J Med Chem 43:2853-60 (2008)  
Target
Name:
Carbonic anhydrase 14
Synonyms:
CA-XIV CAH14_HUMAN Carbonic Anhydrase XIV Carbonic anhydrase 14 Carbonic anhydrase XIV (CA XIV)
Type:
Enzyme
Mol. Mass.:
37665.67
Organism:
Homo sapiens (Human)
Description:
Human (cloned) isozyme.
Residue:
337
  
Inhibitor
Name:
BDBM11037
Synonyms:
2-propylamido-5-sulfonamidoindane Indanesulfonamide Derivative 12e | N-(5-sulfamoyl-2,3-dihydro-1H-inden-2-yl)butanamide
Type:
Small organic molecule
Emp. Form.:
C13H18N2O3S
Mol. Mass.:
282.359
SMILES:
CCCC(=O)NC1Cc2ccc(cc2C1)S(N)(=O)=O
: