Target
Carbonic anhydrase 7
Ligand
BDBM50266093
Substrate
Meas. Tech.
ChEMBL_544671 (CHEMBL1009248)
Ki
1.5±n/a nM
Citation
 Thiry, ARolin, SVullo, DFrankart, AScozzafava, ADogné, JMWouters, JSupuran, CTMasereel, B Indanesulfonamides as carbonic anhydrase inhibitors and anticonvulsant agents: structure-activity relationship and pharmacological evaluation. Eur J Med Chem 43:2853-60 (2008)  
Target
Name:
Carbonic anhydrase 7
Synonyms:
CA-VII CAH7_HUMAN Carbonic anhydrase Carbonic anhydrase VII (CA VII)
Type:
Enzyme
Mol. Mass.:
29664.11
Organism:
Homo sapiens (Human)
Description:
Human cloned isozyme.
Residue:
264
  
Inhibitor
Name:
BDBM50266093
Synonyms:
CHEMBL456889 | N-(5-sulfamoyl-2,3-dihydro-1H-inden-1-yl)decanamide
Type:
Small organic molecule
Emp. Form.:
C19H30N2O3S
Mol. Mass.:
366.518
SMILES:
CCCCCCCCCC(=O)NC1CCc2cc(ccc12)S(N)(=O)=O
: