Target
Heat shock protein HSP 90-beta
Ligand
BDBM15374
Substrate
Meas. Tech.
ChEMBL_543925 (CHEMBL1020360)
EC50
15000±n/a nM
Citation
 Taldone, TSun, WChiosis, G Discovery and development of heat shock protein 90 inhibitors. Bioorg Med Chem 17:2225-35 (2009)  
Target
Name:
Heat shock protein HSP 90-beta
Synonyms:
HS90B_HUMAN HSP 90 HSP90B HSPCB Heat shock protein HSP 90 (Hsp90)
Type:
Molecular Chaperone
Mol. Mass.:
83229.45
Organism:
Homo sapiens (Human)
Description:
P08238
Residue:
724
  
Inhibitor
Name:
BDBM15374
Synonyms:
9-butyl-8-(3,4,5-trimethoxybenzyl)-9H-purin-6-amine CHEMBL113690 Purine-Based Inhibitor 1
Type:
Small organic molecule
Emp. Form.:
C19H25N5O3
Mol. Mass.:
371.4335
SMILES:
CCCCn1c(Cc2cc(OC)c(OC)c(OC)c2)nc2c(N)ncnc12
: