Target
Carbonic anhydrase 2
Ligand
BDBM50258733
Substrate
Meas. Tech.
ChEMBL_499839 (CHEMBL972471)
Ki
3820±n/a nM
Citation
 Gitto, RFerro, SAgnello, SDe Luca, LDe Sarro, GRusso, EVullo, DSupuran, CTChimirri, A Synthesis and evaluation of pharmacological profile of 1-aryl-6,7-dimethoxy-3,4-dihydroisoquinoline-2(1H)-sulfonamides. Bioorg Med Chem 17:3659-64 (2009)  
Target
Name:
Carbonic anhydrase 2
Synonyms:
CA-II CAC Carbonate dehydratase II Carbonic anhydrase 2 (CA-II) Carbonic anhydrase C Carbonic anhydrase II (CA-II) Carbonic anhydrase II (hCA II) | Carbonic anhydrase isoenzyme II (hCA II)
Type:
Enzyme
Mol. Mass.:
29250.71
Organism:
Homo sapiens (Human)
Description:
P00918
Residue:
260
  
Inhibitor
Name:
BDBM50258733
Synonyms:
6,7-Dimethoxy-1-(3'-nitrophenyl)-3,4-dihydroisoquinoline-2(1H)-sulfonamide | CHEMBL468105
Type:
Small organic molecule
Emp. Form.:
C17H19N3O6S
Mol. Mass.:
393.414
SMILES:
COc1cc2CCN(C(c3cccc(c3)[N+]([O-])=O)c2cc1OC)S(N)(=O)=O
: